Target
Gag-Pol polyprotein [600-1027,R876K]/[600-1155]
Ligand
BDBM2047
Substrate
poly(rC)500:oligo(dG)10
Meas. Tech.
HIV-1 RT Assay
pH
7.8±n/a
Temperature
295.15±n/a K
IC50
30±n/a nM
Citation
 Cywin, CLSarver, RWKlunder, JMBills, EHoermann, MBolton, GBratton, LDBrickwood, JRCaspers, NLDavid, EDunbar, JBGrob, PMSchwartz, RHarris, MSPauletti, DHutchings, RHBarringer, KJKennedy, RMShih, CKLarsen, SDPavlovsky, ASorge, CLErickson, DAPfefferkorn, JAJoseph, DPBainbridge, GHattox, SE Thermodynamic and structure guided design of statin based inhibitors of 3-hydroxy-3-methylglutaryl coenzyme A reductase. J Med Chem 51:3804-13 (2008)  
Target
Name:
Gag-Pol polyprotein [600-1027,R876K]/[600-1155]
Synonyms:
EC: 2.7.7.49 | HIV-1 Reverse Transcriptase
Type:
Protein Complex
Mol. Mass.:
113858
Description:
Components:
This complex has 2 components.
Component 1
Name:
Gag-Pol polyprotein [600-1155]
Synonyms:
HIV-1 Reverse Transcriptase Chain A gag-pol
Type:
Enzyme Subunit
Mol. Mass.:
63928.81
Organism:
Human immunodeficiency virus type 1
Description:
P03366[600-1155]
Residue:
556
  
Component 2
Name:
Gag-Pol polyprotein [600-1027,R876K]
Synonyms:
HIV-1 Reverse Transcriptase Chain B gag-pol
Type:
Enzyme Subunit
Mol. Mass.:
49968.63
Organism:
Human immunodeficiency virus type 1
Description:
P03366[600-1027,R876K]
Residue:
428
  
Inhibitor
Name:
BDBM2047
Synonyms:
2,8-disubstituted dipyridodiazepinone 30 5-chloro-2-ethyl-9-methyl-13-{[(2-methylpyridin-4-yl)oxy]methyl}-2,4,9,15-tetraazatricyclo[9.4.0.0^{3,8}]pentadeca-1(11),3,5,7,12,14-hexaen-10-one
Type:
Small organic molecule
Emp. Form.:
C21H20ClN5O2
Mol. Mass.:
409.869
SMILES:
CCN1c2nc(Cl)ccc2N(C)C(=O)c2cc(COc3ccnc(C)c3)cnc12
:
Substrate
Name:
poly(rC)500:oligo(dG)10
Synonyms:
Type:
RNA\DNA duplex
Mol. Mass.:
358.43
Organism:
Description:
The incorporation of Tritium-labeled dGTP onto a (poly)rC:(oligo)dG template:primer.
Residue:
3
NA