Target
Mucolipin-3
Ligand
BDBM46945
Substrate
Meas. Tech.
Dose response cell-based high-throughput screening assay for agonists of the transient receptor potential channel ML3 (TRPML3)
EC50
1430±n/a nM
Citation
 PubChem, PC Dose response cell-based high-throughput screening assay for agonists of the transient receptor potential channel ML3 (TRPML3) PubChem Bioassay (2009)[AID] 
Target
Name:
Mucolipin-3
Synonyms:
MCLN3_HUMAN MCOLN3 protein
Type:
Enzyme Catalytic Domain
Mol. Mass.:
64244.09
Organism:
Homo sapiens (Human)
Description:
Q8TDD5
Residue:
553
  
Inhibitor
Name:
BDBM46945
Synonyms:
1-(2,4-dimethylphenyl)-4-(1-piperidinylsulfonyl)piperazine 1-(2,4-dimethylphenyl)-4-piperidin-1-ylsulfonylpiperazine MLS000715887 cid_701237
Type:
Small organic molecule
Emp. Form.:
C17H27N3O2S
Mol. Mass.:
337.48
SMILES:
Cc1ccc(N2CCN(CC2)S(=O)(=O)N2CCCCC2)c(C)c1
: