Target
Procathepsin L
Ligand
BDBM41145
Substrate
Meas. Tech.
Cathepsin L dose-response testing in the presence of cysteine
IC50
5283.313333±988.384336 nM
Citation
 PubChem, PC Cathepsin L dose-response testing in the presence of cysteine PubChem Bioassay (2009)[AID] 
Target
Name:
Procathepsin L
Synonyms:
CATL1_HUMAN CTSL CTSL1 Cathepsin L Cathepsin L1 heavy chain MEP cathepsin L preproprotein
Type:
Enzyme
Mol. Mass.:
37557.19
Organism:
Homo sapiens (Human)
Description:
Purchased from Calbiochem (San Diego, CA).
Residue:
333
  
Inhibitor
Name:
BDBM41145
Synonyms:
MLS000082576 cid_665065
Type:
Small organic molecule
Emp. Form.:
C23H25N5O2S2
Mol. Mass.:
467.607
SMILES:
CSc1nc(N2CCN(CCO)CC2)c2sc3nc(c4CCCc4c3c2n1)-c1ccco1
: