Target
Procathepsin L
Ligand
BDBM41165
Substrate
Meas. Tech.
Cathepsin L dose-response testing in the presence of cysteine
IC50
2679.09±597.836383 nM
Citation
 PubChem, PC Cathepsin L dose-response testing in the presence of cysteine PubChem Bioassay (2009)[AID] 
Target
Name:
Procathepsin L
Synonyms:
CATL1_HUMAN CTSL CTSL1 Cathepsin L Cathepsin L1 heavy chain MEP cathepsin L preproprotein
Type:
Enzyme
Mol. Mass.:
37557.19
Organism:
Homo sapiens (Human)
Description:
Purchased from Calbiochem (San Diego, CA).
Residue:
333
  
Inhibitor
Name:
BDBM41165
Synonyms:
MLS000094118 N-[2-(azepan-1-yl)ethyl]-2-[(2-methyl-1,3-benzothiazol-6-yl)sulfonylamino]acetamide N~1~-(2-azepan-1-ylethyl)-N~2~-[(2-methyl-1,3-benzothiazol-6-yl)sulfonyl]glycinamide cid_3243294
Type:
Small organic molecule
Emp. Form.:
C18H26N4O3S2
Mol. Mass.:
410.554
SMILES:
Cc1nc2ccc(cc2s1)S(=O)(=O)NCC(=O)NCCN1CCCCCC1
: