Target
Regulator of G-protein signaling 16
Ligand
BDBM32329
Substrate
Meas. Tech.
Dose respone, multiplexed high-throughput screen for small molecule regulators of RGS family protein interactions, specifically RGS16-Galphao.
EC50
9680±n/a nM
Citation
 PubChem, PC Dose respone, multiplexed high-throughput screen for small molecule regulators of RGS family protein interactions, specifically RGS16-Galphao. PubChem Bioassay (2009)[AID] 
Target
Name:
Regulator of G-protein signaling 16
Synonyms:
RGS16 RGSR regulator of G-protein signalling 16
Type:
Enzyme Catalytic Domain
Mol. Mass.:
22748.87
Organism:
Homo sapiens (Human)
Description:
gi_156416009
Residue:
202
  
Inhibitor
Name:
BDBM32329
Synonyms:
(2Z)-3-ethyl-2-[(E)-3-(3-ethyl-1,3-benzothiazol-3-ium-2-yl)-2-methyl-prop-2-enylidene]-1,3-benzothiazole;iodide Cyanines, 1 SMR000354813 | cid_6364517
Type:
Small organic molecule
Emp. Form.:
C22H23N2S2
Mol. Mass.:
379.561
SMILES:
CCN1\C(Sc2ccccc12)=C\C(\C)=C\c1sc2ccccc2[n+]1CC
: