Target
Dual specificity protein phosphatase 3
Ligand
BDBM46206
Substrate
Meas. Tech.
SAR VHR1 Fluorescent Assay for In Vitro dose response studies
IC50
>99000±n/a nM
Citation
 PubChem, PC SAR VHR1 Fluorescent Assay for In Vitro dose response studies PubChem Bioassay (2009)[AID] 
Target
Name:
Dual specificity protein phosphatase 3
Synonyms:
DUS3_HUMAN Dual specificity protein phosphatase (VHR) Dual specificity protein phosphatase VHR Tyrosine-protein phosphatase non-receptor type 1 | VHR
Type:
Hydrolase
Mol. Mass.:
20480.58
Organism:
Homo sapiens (Human)
Description:
Residue:
185
  
Inhibitor
Name:
BDBM46206
Synonyms:
MLS-0109562.0001 [1-(2-phenoxyethyl)indol-3-yl]-pyrrolidin-1-yl-methanethione [1-(2-phenoxyethyl)indol-3-yl]-pyrrolidino-methanethione | cid_1324805
Type:
Small organic molecule
Emp. Form.:
C21H22N2OS
Mol. Mass.:
350.477
SMILES:
S=C(N1CCCC1)c1cn(CCOc2ccccc2)c2ccccc12
: