Target
Matrix metalloproteinase-14 [1-36]
Ligand
BDBM48214
Substrate
Meas. Tech.
Luminescent HTS for small molecule inhibitors of MT1-MMP transcription
EC50
3930±n/a nM
Citation
 PubChem, PC Luminescent HTS for small molecule inhibitors of MT1-MMP transcription PubChem Bioassay (2008)[AID] 
Target
Name:
Matrix metalloproteinase-14 [1-36]
Synonyms:
MMP14 matrix metalloproteinase 1
Type:
Enzyme Catalytic Domain
Mol. Mass.:
3658.23
Organism:
Homo sapiens (Human)
Description:
gi_6690534
Residue:
36
  
Inhibitor
Name:
BDBM48214
Synonyms:
3-(5-Ethyl-benzooxazol-2-yl)-phenylamine MLS000525240 [3-(5-ethyl-1,3-benzoxazol-2-yl)phenyl]amine | cid_735963
Type:
Small organic molecule
Emp. Form.:
C15H14N2O
Mol. Mass.:
238.2845
SMILES:
CCc1ccc2oc(nc2c1)-c1cccc(N)c1
: