Target
Estrogen receptor beta
Ligand
BDBM48301
Substrate
Meas. Tech.
Estrogen Receptor-beta Coactivator Binding Inhibitors Dose Response Confirmation
IC50
4510.28±n/a nM
Citation
 PubChem, PC Estrogen Receptor-beta Coactivator Binding Inhibitors Dose Response Confirmation PubChem Bioassay (2007)[AID] 
Target
Name:
Estrogen receptor beta
Synonyms:
ER-beta ESR2_HUMAN Estradiol receptor beta (ERβ) Estrogen receptor (ER beta) Estrogen receptor beta (ER beta) NR3A2 estrogen beta
Type:
Protein
Mol. Mass.:
59238.43
Organism:
Homo sapiens (Human)
Description:
Q92731
Residue:
530
  
Inhibitor
Name:
BDBM48301
Synonyms:
2-(2-Thiophen-2-yl-acetylamino)-4,5,6,7-tetrahydro-benzo[b]thiophene-3-carboxylic acid methyl ester 2-[[2-(2-thienyl)acetyl]amino]-4,5,6,7-tetrahydrobenzothiophene-3-carboxylic acid methyl ester SMR000009005 methyl 2-(2-thiophen-2-ylethanoylamino)-4,5,6,7-tetrahydro-1-benzothiophene-3-carboxylate | methyl 2-[(2-thiophen-2-ylacetyl)amino]-4,5,6,7-tetrahydro-1-benzothiophene-3-carboxylate
Type:
Small organic molecule
Emp. Form.:
C16H17NO3S2
Mol. Mass.:
335.441
SMILES:
COC(=O)c1c(NC(=O)Cc2cccs2)sc2CCCCc12
: