Target
Estrogen receptor beta
Ligand
BDBM48462
Substrate
Meas. Tech.
Estrogen Receptor-beta Coactivator Binding Inhibitors Dose Response Confirmation
IC50
2601.96±n/a nM
Citation
 PubChem, PC Estrogen Receptor-beta Coactivator Binding Inhibitors Dose Response Confirmation PubChem Bioassay (2007)[AID] 
Target
Name:
Estrogen receptor beta
Synonyms:
ER-beta ESR2_HUMAN Estradiol receptor beta (ERβ) Estrogen receptor (ER beta) Estrogen receptor beta (ER beta) NR3A2 estrogen beta
Type:
Protein
Mol. Mass.:
59238.43
Organism:
Homo sapiens (Human)
Description:
Q92731
Residue:
530
  
Inhibitor
Name:
BDBM48462
Synonyms:
2-(2-furanyl)-N-hexyl-4-quinolinecarboxamide 2-(2-furyl)-N-hexyl-cinchoninamide 2-(furan-2-yl)-N-hexylquinoline-4-carboxamide SMR000114759 | cid_1742630
Type:
Small organic molecule
Emp. Form.:
C20H22N2O2
Mol. Mass.:
322.4009
SMILES:
CCCCCCNC(=O)c1cc(nc2ccccc12)-c1ccco1
: