Target
D(1A) dopamine receptor
Ligand
BDBM39938
Substrate
Meas. Tech.
Allosteric Modulators of D1 Receptors: Dose-dependent Assay
EC50
0.00114±n/a nM
Citation
 PubChem, PC Allosteric Modulators of D1 Receptors: Dose-dependent Assay PubChem Bioassay (2007)[AID] 
Target
Name:
D(1A) dopamine receptor
Synonyms:
DA D1 receptor DRD1 Dopamine D1 receptor Dopamine D1A
Type:
Enzyme
Mol. Mass.:
49303.43
Organism:
Homo sapiens (Human)
Description:
P21728
Residue:
446
  
Inhibitor
Name:
BDBM39938
Synonyms:
6-cyclohexyl-3-(1,4,5,6-tetrahydrocyclopenta[c]pyrazol-3-yl)-[1,2,4]triazolo[3,4-b][1,3,4]thiadiazole SMR000046849 | cid_665639
Type:
Small organic molecule
Emp. Form.:
C15H18N6S
Mol. Mass.:
314.409
SMILES:
C1Cc2[nH]nc(c2C1)-c1nnc2sc(nn12)C1CCCCC1
: