Target
D(1A) dopamine receptor
Ligand
BDBM49040
Substrate
Meas. Tech.
Allosteric Modulators of D1 Receptors: Dose-dependent Assay
EC50
0.00231±n/a nM
Citation
 PubChem, PC Allosteric Modulators of D1 Receptors: Dose-dependent Assay PubChem Bioassay (2007)[AID] 
Target
Name:
D(1A) dopamine receptor
Synonyms:
DA D1 receptor DRD1 Dopamine D1 receptor Dopamine D1A
Type:
Enzyme
Mol. Mass.:
49303.43
Organism:
Homo sapiens (Human)
Description:
P21728
Residue:
446
  
Inhibitor
Name:
BDBM49040
Synonyms:
7-(4-carbomethoxyphenyl)-5-methyl-2-(methylthio)-1,7-dihydro-[1,2,4]triazolo[1,5-a]pyrimidine-6-carboxylic acid ethyl ester MLS000044884 cid_5771277 ethyl 7-[4-(methoxycarbonyl)phenyl]-5-methyl-2-(methylthio)-4,7-dihydro[1,2,4]triazolo[1,5-a]pyrimidine-6-carboxylate
Type:
Small organic molecule
Emp. Form.:
C18H20N4O4S
Mol. Mass.:
388.441
SMILES:
CCOC(=O)C1C(c2ccc(cc2)C(=O)OC)n2nc(SC)nc2N=C1C
: