Target
D(1A) dopamine receptor
Ligand
BDBM48950
Substrate
Meas. Tech.
Allosteric Modulators of D1 Receptors: Dose-dependent Assay
EC50
0.00202±n/a nM
Citation
 PubChem, PC Allosteric Modulators of D1 Receptors: Dose-dependent Assay PubChem Bioassay (2007)[AID] 
Target
Name:
D(1A) dopamine receptor
Synonyms:
DA D1 receptor DRD1 Dopamine D1 receptor Dopamine D1A
Type:
Enzyme
Mol. Mass.:
49303.43
Organism:
Homo sapiens (Human)
Description:
P21728
Residue:
446
  
Inhibitor
Name:
BDBM48950
Synonyms:
1-butyl-5-keto-2-nicotinoylimino-dipyrido[1,2-d:3',4'-f]pyrimidine-3-carboxylic acid ethyl ester MLS000044284 cid_2058645 ethyl 1-butyl-5-oxidanylidene-2-pyridin-3-ylcarbonylimino-dipyrido[1,2-d:3',4'-f]pyrimidine-3-carboxylate | ethyl 1-butyl-5-oxo-2-(pyridine-3-carbonylimino)dipyrido[1,2-d:3',4'-f]pyrimidine-3-carboxylate
Type:
Small organic molecule
Emp. Form.:
C24H23N5O4
Mol. Mass.:
445.4705
SMILES:
CCCCn1c2nc3ccccn3c(=O)c2cc(C(=O)OCC)\c1=N/C(=O)c1cccnc1
: