Target
D(1A) dopamine receptor
Ligand
BDBM43583
Substrate
Meas. Tech.
Allosteric Modulators of D1 Receptors: Dose-dependent Assay
EC50
0.00483±n/a nM
Citation
 PubChem, PC Allosteric Modulators of D1 Receptors: Dose-dependent Assay PubChem Bioassay (2007)[AID] 
Target
Name:
D(1A) dopamine receptor
Synonyms:
DA D1 receptor DRD1 Dopamine D1 receptor Dopamine D1A
Type:
Enzyme
Mol. Mass.:
49303.43
Organism:
Homo sapiens (Human)
Description:
P21728
Residue:
446
  
Inhibitor
Name:
BDBM43583
Synonyms:
4-(3,4-dihydro-2H-quinolin-1-yl)-[1,2,4]triazolo[4,3-a]quinoxaline SMR000095947 | cid_5307993
Type:
Small organic molecule
Emp. Form.:
C18H15N5
Mol. Mass.:
301.3452
SMILES:
C1CN(c2ccccc2C1)c1nc2ccccc2n2cnnc12
: