Target
Induced myeloid leukemia cell differentiation protein Mcl-1
Ligand
BDBM50303396
Substrate
Meas. Tech.
Dose Response Confirmation for Mcl-1/Noxa Interaction Inhibitors
IC50
400±n/a nM
Citation
 PubChem, PC Dose Response Confirmation for Mcl-1/Noxa Interaction Inhibitors PubChem Bioassay (2008)[AID] 
Target
Name:
Induced myeloid leukemia cell differentiation protein Mcl-1
Synonyms:
BCL2L3 Bcl-2-like protein 3 (Mcl-1) Bcl2-L-3 MCL1 Mcl-1 Myeloid cell leukemia sequence 1 (BCL2-related) | mcl1/EAT
Type:
Membrane; Single-pass membrane protein
Mol. Mass.:
37332.87
Organism:
Homo sapiens (Human)
Description:
Q07820
Residue:
350
  
Inhibitor
Name:
BDBM50303396
Synonyms:
2-(benzo[d][1,3]dioxol-5-ylmethylamino)-2-oxoethyl 2-(furan-2-yl)quinoline-4-carboxylate cid_2368254
Type:
Small organic molecule
Emp. Form.:
C24H18N2O6
Mol. Mass.:
430.4095
SMILES:
O=C(COC(=O)c1cc(nc2ccccc12)-c1ccco1)NCc1ccc2OCOc2c1
: