Target
Induced myeloid leukemia cell differentiation protein Mcl-1
Ligand
BDBM44477
Substrate
Meas. Tech.
Dose Response Confirmation for Mcl-1/Noxa Interaction Inhibitors
IC50
1537.318349±n/a nM
Citation
 PubChem, PC Dose Response Confirmation for Mcl-1/Noxa Interaction Inhibitors PubChem Bioassay (2008)[AID] 
Target
Name:
Induced myeloid leukemia cell differentiation protein Mcl-1
Synonyms:
BCL2L3 Bcl-2-like protein 3 (Mcl-1) Bcl2-L-3 MCL1 Mcl-1 Myeloid cell leukemia sequence 1 (BCL2-related) | mcl1/EAT
Type:
Membrane; Single-pass membrane protein
Mol. Mass.:
37332.87
Organism:
Homo sapiens (Human)
Description:
Q07820
Residue:
350
  
Inhibitor
Name:
BDBM44477
Synonyms:
2-(5-Furan-2-yl-2,2-dimethyl-10-methylsulfanyl-1,4-dihydro-2H-3-oxa-7-thia-6,9,11-triaza-benzo[c]fluore n-8-ylsulfanyl)-ethanol SMR000148842 | cid_2005835
Type:
Small organic molecule
Emp. Form.:
C21H21N3O3S3
Mol. Mass.:
459.605
SMILES:
CSc1nc(SCCO)c2sc3nc(-c4ccco4)c4COC(C)(C)Cc4c3c2n1
: