Target
Induced myeloid leukemia cell differentiation protein Mcl-1
Ligand
BDBM50379
Substrate
Meas. Tech.
Dose Response Confirmation for Mcl-1/Noxa Interaction Inhibitors
IC50
473.030829±n/a nM
Citation
 PubChem, PC Dose Response Confirmation for Mcl-1/Noxa Interaction Inhibitors PubChem Bioassay (2008)[AID] 
Target
Name:
Induced myeloid leukemia cell differentiation protein Mcl-1
Synonyms:
BCL2L3 Bcl-2-like protein 3 (Mcl-1) Bcl2-L-3 MCL1 Mcl-1 Myeloid cell leukemia sequence 1 (BCL2-related) | mcl1/EAT
Type:
Membrane; Single-pass membrane protein
Mol. Mass.:
37332.87
Organism:
Homo sapiens (Human)
Description:
Q07820
Residue:
350
  
Inhibitor
Name:
BDBM50379
Synonyms:
MLS000662732 SMR000270188 butyl [4-(dimethylamino)phenyl]carbamate | cid_1562744
Type:
Small organic molecule
Emp. Form.:
C13H20N2O2
Mol. Mass.:
236.3101
SMILES:
CCCCOC(=O)Nc1ccc(cc1)N(C)C
: