Target
Induced myeloid leukemia cell differentiation protein Mcl-1
Ligand
BDBM33024
Substrate
Meas. Tech.
Dose Response Confirmation for Mcl-1/Noxa Interaction Inhibitors
IC50
1555.008647±n/a nM
Citation
 PubChem, PC Dose Response Confirmation for Mcl-1/Noxa Interaction Inhibitors PubChem Bioassay (2008)[AID] 
Target
Name:
Induced myeloid leukemia cell differentiation protein Mcl-1
Synonyms:
BCL2L3 Bcl-2-like protein 3 (Mcl-1) Bcl2-L-3 MCL1 Mcl-1 Myeloid cell leukemia sequence 1 (BCL2-related) | mcl1/EAT
Type:
Membrane; Single-pass membrane protein
Mol. Mass.:
37332.87
Organism:
Homo sapiens (Human)
Description:
Q07820
Residue:
350
  
Inhibitor
Name:
BDBM33024
Synonyms:
MLS000697664 SMR000445568 | cid_5388496
Type:
Small organic molecule
Emp. Form.:
C34H22O22
Mol. Mass.:
782.5253
SMILES:
OC1OC2COC(=O)c3cc(O)c(O)c(O)c3-c3c(O)c(O)c4oc(=O)c5c(c(O)c(O)c6oc(=O)c3c4c56)-c3c(O)c(O)c(O)cc3C(=O)OC2C(O)C1O
: