Target
Ion channel NompC
Ligand
BDBM46949
Substrate
Meas. Tech.
Fluorescence counterscreen assay for TRPML3 agonists: dose response cell-based high-throughput screening assay to identify agonists of the transient receptor potential channel N1 (TRPN1)
EC50
29900±n/a nM
Citation
 PubChem, PC Fluorescence counterscreen assay for TRPML3 agonists: dose response cell-based high-throughput screening assay to identify agonists of the transient receptor potential channel N1 (TRPN1) PubChem Bioassay (2009)[AID] 
Target
Name:
Ion channel NompC
Synonyms:
transient receptor potential cation channel, subfamily N, member 1
Type:
Enzyme Catalytic Domain
Mol. Mass.:
175824.78
Organism:
Danio rerio
Description:
Q7T1G6
Residue:
1614
  
Inhibitor
Name:
BDBM46949
Synonyms:
MLS000689886 N-(4-methoxy-2-nitrophenyl)-N,4-dimethylbenzenesulfonamide cid_2905111
Type:
Small organic molecule
Emp. Form.:
C15H16N2O5S
Mol. Mass.:
336.363
SMILES:
COc1ccc(N(C)S(=O)(=O)c2ccc(C)cc2)c(c1)[N+]([O-])=O
: