Target
Mitogen-activated protein kinase kinase kinase kinase 2
Ligand
BDBM51803
Substrate
Meas. Tech.
Dose Response Confirmation via Multiplex HTS Assay for Inhibitors of MEK Kinase PB1 Domains, specifically MEK5 binding to MEK Kinase 2 Wildtype
EC50
30000±n/a nM
Citation
 PubChem, PC Dose Response Confirmation via Multiplex HTS Assay for Inhibitors of MEK Kinase PB1 Domains, specifically MEK5 binding to MEK Kinase 2 Wildtype PubChem Bioassay (2009)[AID] 
Target
Name:
Mitogen-activated protein kinase kinase kinase kinase 2
Synonyms:
2.7.11.1 GC kinase Germinal center kinase MAP4K2 MEK kinase kinase 2 RAB8IP | Rab8-interacting protein
Type:
Mol. Mass.:
91551.35
Organism:
Homo sapiens (Human)
Description:
Residue:
820
  
Inhibitor
Name:
BDBM51803
Synonyms:
2-[4-(Acetyl-phenyl-amino)-buta-1,3-dienyl]-3-ethyl-benzothiazol-3-ium N-[(1E,3E)-4-(3-ethyl-1,3-benzothiazol-3-ium-2-yl)buta-1,3-dienyl]-N-phenyl-acetamide;iodide N-[(1E,3E)-4-(3-ethyl-1,3-benzothiazol-3-ium-2-yl)buta-1,3-dienyl]-N-phenylacetamide;iodide cid_5717129
Type:
Small organic molecule
Emp. Form.:
C21H21N2OS
Mol. Mass.:
349.469
SMILES:
CC[n+]1c(\C=C\C=C\N(C(C)=O)c2ccccc2)sc2ccccc12
: