Target
Beta-lactamase
Ligand
BDBM51992
Substrate
Meas. Tech.
Epi-absorbance-based counterscreen for selective VIM-2 inhibitors: dose response biochemical high throughput screening assay to identify inhibitors of IMP-1 metallo-beta-lactamase.
IC50
59640±n/a nM
Citation
 PubChem, PC Epi-absorbance-based counterscreen for selective VIM-2 inhibitors: dose response biochemical high throughput screening assay to identify inhibitors of IMP-1 metallo-beta-lactamase. PubChem Bioassay (2009)[AID] 
Target
Name:
Beta-lactamase
Synonyms:
Beta-lactamase | metallo-beta-lactamase IMP-1
Type:
Enzyme Catalytic Domain
Mol. Mass.:
27125.88
Organism:
Pseudomonas aeruginosa
Description:
gi_27368096
Residue:
246
  
Inhibitor
Name:
BDBM51992
Synonyms:
3-[[(E)-[2-(4-bromobenzyl)oxybenzylidene]amino]thiocarbamoylamino]benzoic acid 3-[[[2-[(4-bromophenyl)methoxy]phenyl]methylideneamino]carbamothioylamino]benzoic acid 3-{[(2-{2-[(4-bromobenzyl)oxy]benzylidene}hydrazino)carbonothioyl]amino}benzoic acid SMR000312756 | cid_16195462
Type:
Small organic molecule
Emp. Form.:
C22H18BrN3O3S
Mol. Mass.:
484.366
SMILES:
OC(=O)c1cccc(NC(=S)NN=Cc2ccccc2OCc2ccc(Br)cc2)c1
: