Target
POsterior Segregation
Ligand
BDBM51785
Substrate
Meas. Tech.
Fluorescent Polarization Homogeneous Dose Response HTS to Indentify Inhibitors of POS-1 Binding to mex-3-RNA
EC50
10384±n/a nM
Citation
 PubChem, PC Fluorescent Polarization Homogeneous Dose Response HTS to Indentify Inhibitors of POS-1 Binding to mex-3-RNA PubChem Bioassay (2009)[AID] 
Target
Name:
POsterior Segregation
Synonyms:
POsterior Segregation family member (pos-1)
Type:
Enzyme Catalytic Domain
Mol. Mass.:
29838.90
Organism:
Caenorhabditis elegans
Description:
gi_17562800
Residue:
264
  
Inhibitor
Name:
BDBM51785
Synonyms:
(5E)-1-(2,5-dimethoxyphenyl)-5-(2-furanylmethylidene)-2-sulfanylidene-1,3-diazinane-4,6-dione (5E)-1-(2,5-dimethoxyphenyl)-5-(2-furylmethylene)-2-thioxodihydropyrimidine-4,6(1H,5H)-dione MLS001197216 cid_1608674
Type:
Small organic molecule
Emp. Form.:
C17H14N2O5S
Mol. Mass.:
358.368
SMILES:
COc1ccc(OC)c(c1)N1C(=S)NC(=O)C(=Cc2ccco2)C1=O
: