Target
POsterior Segregation
Ligand
BDBM52213
Substrate
Meas. Tech.
Fluorescent Polarization Homogeneous Dose Response HTS to Indentify Inhibitors of POS-1 Binding to mex-3-RNA
EC50
300000±n/a nM
Citation
 PubChem, PC Fluorescent Polarization Homogeneous Dose Response HTS to Indentify Inhibitors of POS-1 Binding to mex-3-RNA PubChem Bioassay (2009)[AID] 
Target
Name:
POsterior Segregation
Synonyms:
POsterior Segregation family member (pos-1)
Type:
Enzyme Catalytic Domain
Mol. Mass.:
29838.90
Organism:
Caenorhabditis elegans
Description:
gi_17562800
Residue:
264
  
Inhibitor
Name:
BDBM52213
Synonyms:
4-[2,5-dimethyl-3-(1,2,4-triazol-4-yliminomethyl)-1-pyrrolyl]benzoic acid MLS000111963 cid_674245
Type:
Small organic molecule
Emp. Form.:
C16H15N5O2
Mol. Mass.:
309.3226
SMILES:
Cc1cc(C=Nn2cnnc2)c(C)n1-c1ccc(cc1)C(O)=O
: