Target
Mannose-6-phosphate isomerase
Ligand
BDBM53639
Substrate
Meas. Tech.
HTS identification of compounds inhibiting phosphomannose isomerase (PMI) via a fluorescence intensity assay.
IC50
50000±n/a nM
Citation
 PubChem, PC HTS identification of compounds inhibiting phosphomannose isomerase (PMI) via a fluorescence intensity assay. PubChem Bioassay (2009)[AID] 
Target
Name:
Mannose-6-phosphate isomerase
Synonyms:
MPI MPI_HUMAN PMI1
Type:
PROTEIN
Mol. Mass.:
46651.35
Organism:
Homo sapiens (Human)
Description:
ChEMBL_1448919
Residue:
423
  
Inhibitor
Name:
BDBM53639
Synonyms:
2-[(2-fluorophenyl)thio]-N-(3-keto-1,5-dimethyl-2-phenyl-3-pyrazolin-4-yl)acetamide N-(1,5-dimethyl-3-oxidanylidene-2-phenyl-pyrazol-4-yl)-2-(2-fluorophenyl)sulfanyl-ethanamide N-(1,5-dimethyl-3-oxo-2-phenylpyrazol-4-yl)-2-(2-fluorophenyl)sulfanylacetamide cid_2591864
Type:
Small organic molecule
Emp. Form.:
C19H18FN3O2S
Mol. Mass.:
371.429
SMILES:
Cc1c(NC(=O)CSc2ccccc2F)c(=O)n(-c2ccccc2)n1C
: