Target
SUMO-conjugating enzyme UBC9
Ligand
BDBM40251
Substrate
Meas. Tech.
AlphaScreen confirmatory assay for validation of inhibitors of SUMOylation
IC50
11450±n/a nM
Citation
 PubChem, PC AlphaScreen confirmatory assay for validation of inhibitors of SUMOylation PubChem Bioassay (2010)[AID] 
Target
Name:
SUMO-conjugating enzyme UBC9
Synonyms:
UBC9 UBCE9 ubiquitin-conjugating enzyme E2I
Type:
Enzyme Catalytic Domain
Mol. Mass.:
18011.66
Organism:
Homo sapiens (Human)
Description:
gi_4507785
Residue:
158
  
Inhibitor
Name:
BDBM40251
Synonyms:
2-(4-fluoroanilino)-6-[(1-phenyltetrazol-5-yl)sulfanylmethyl]-1H-pyrimidin-4-one 2-(4-fluoroanilino)-6-[[(1-phenyltetrazol-5-yl)thio]methyl]-1H-pyrimidin-4-one 2-[(4-fluorophenyl)amino]-6-{[(1-phenyl-1H-tetrazol-5-yl)thio]methyl}-4(3H)-pyrimidinone SMR000135863 | cid_1214378
Type:
Small organic molecule
Emp. Form.:
C18H14FN7OS
Mol. Mass.:
395.413
SMILES:
Fc1ccc(Nc2nc(CSc3nnnn3-c3ccccc3)cc(=O)[nH]2)cc1
: