Target
Cell division control protein 42 homolog
Ligand
BDBM54641
Substrate
Meas. Tech.
Pyrazoline SAR compounds tested via Multiplex dose response to identify specific small molecule inhibitors of Ras and Ras-related GTPases specifically Cdc42 activated mutant
EC50
2877±n/a nM
Citation
 PubChem, PC Pyrazoline SAR compounds tested via Multiplex dose response to identify specific small molecule inhibitors of Ras and Ras-related GTPases specifically Cdc42 activated mutant PubChem Bioassay (2009)[AID] 
Target
Name:
Cell division control protein 42 homolog
Synonyms:
CDC42 Cell division control protein 42 homolog cell division cycle 42 (GTP binding protein, 25kDa)
Type:
PROTEIN
Mol. Mass.:
21258.36
Organism:
Homo sapiens (Human)
Description:
ChEMBL_652970
Residue:
191
  
Inhibitor
Name:
BDBM54641
Synonyms:
4-[3-(2-chlorophenyl)-5-(4-methoxyphenyl)-2-pyrazolin-1-yl]benzenesulfonamide KUC103416N cid_42628052
Type:
Small organic molecule
Emp. Form.:
C22H20ClN3O3S
Mol. Mass.:
441.931
SMILES:
COc1ccc(cc1)C1CC(=NN1c1ccc(cc1)S(N)(=O)=O)c1ccccc1Cl
: