Target
Gag-Pol polyprotein [588-1127,Y768C]/[588-1147,Y768C]
Ligand
BDBM1868
Substrate
(rC)n.(dG)12-18
Meas. Tech.
HIV-1 RT Assay
IC50
13000±n/a nM
Citation
 Cantrell, ASEngelhardt, PHogberg, MJaskunas, SRJohansson, NGJordan, CLKangasmetsa, JKinnick, MDLind, PMorin, JMMuesing, MANoreen, ROberg, BPranc, PSahlberg, CTernansky, RJVasileff, RTVrang, LWest, SJZhang, H Phenethylthiazolylthiourea (PETT) compounds as a new class of HIV-1 reverse transcriptase inhibitors. 2. Synthesis and further structure-activity relationship studies of PETT analogs. J Med Chem 39:4261-74 (1996)  
Target
Name:
Gag-Pol polyprotein [588-1127,Y768C]/[588-1147,Y768C]
Synonyms:
EC: 2.7.7.49 | HIV-1 Reverse Transcriptase Mutant (Y181C)
Type:
Protein Complex
Mol. Mass.:
Description:
Components:
This complex has 2 components.
Component 1
Name:
Gag-Pol polyprotein [588-1147,Y768C]
Synonyms:
HIV-1 Reverse Transcriptase Mutant (Y181C) Chain A gag-pol
Type:
Enzyme Subunit
Mol. Mass.:
64426.38
Organism:
Human immunodeficiency virus type 1
Description:
P04585[588-1147,Y768C]
Residue:
560
  
Component 2
Name:
Gag-Pol polyprotein [588-1127,Y768C]
Synonyms:
HIV-1 Reverse Transcriptase Mutant (Y181C) Chain B gag-pol
Type:
Enzyme Subunit
Mol. Mass.:
51277.10
Organism:
Human immunodeficiency virus type 1
Description:
P04585[588-1127,Y768C]
Residue:
440
  
Inhibitor
Name:
BDBM1868
Synonyms:
(+)-(5S)-4,5,6,7-tetrahydro-9-chloro 5-methyl-6-(3-methyl-2-butenyl)imidazo[4,5,1-jk] [ 1,4] benzodiazepine 2(1M-thione 9-Chloro-TIBO R82913
Type:
Small organic molecule
Emp. Form.:
C16H20ClN3S
Mol. Mass.:
321.868
SMILES:
C[C@H]1Cn2c3c(CN1CC=C(C)C)cc(Cl)cc3[nH]c2=S
:
Substrate
Name:
(rC)n.(dG)12-18
Synonyms:
Type:
RNA-DNA duplex
Mol. Mass.:
358.43
Organism:
Description:
The incorporation of Tritium-labeled dGTP onto a poly(rC):oligo(dG)template:primer.
Residue:
3
NA