Target
Amyloid-beta A4 precursor protein-binding family A member 1
Ligand
BDBM44477
Substrate
Meas. Tech.
uHTS Homogeneous Terbium Time-Resolved Fluorescence Resonance Energy Transfer (HTRF) Assay
IC50
14300±n/a nM
Citation
 PubChem, PC uHTS Homogeneous Terbium Time-Resolved Fluorescence Resonance Energy Transfer (HTRF) Assay PubChem Bioassay (2009)[AID] 
Target
Name:
Amyloid-beta A4 precursor protein-binding family A member 1
Synonyms:
APBA1_RAT Mint1 neuronal munc18-1 binding protein
Type:
Enzyme Catalytic Domain
Mol. Mass.:
92603.32
Organism:
Rattus norvegicus
Description:
gi_2625023
Residue:
839
  
Inhibitor
Name:
BDBM44477
Synonyms:
2-(5-Furan-2-yl-2,2-dimethyl-10-methylsulfanyl-1,4-dihydro-2H-3-oxa-7-thia-6,9,11-triaza-benzo[c]fluore n-8-ylsulfanyl)-ethanol SMR000148842 | cid_2005835
Type:
Small organic molecule
Emp. Form.:
C21H21N3O3S3
Mol. Mass.:
459.605
SMILES:
CSc1nc(SCCO)c2sc3nc(-c4ccco4)c4COC(C)(C)Cc4c3c2n1
: