Target
Amyloid-beta A4 precursor protein-binding family A member 1
Ligand
BDBM54762
Substrate
Meas. Tech.
uHTS Homogeneous Terbium Time-Resolved Fluorescence Resonance Energy Transfer (HTRF) Assay
IC50
11200±n/a nM
Citation
 PubChem, PC uHTS Homogeneous Terbium Time-Resolved Fluorescence Resonance Energy Transfer (HTRF) Assay PubChem Bioassay (2009)[AID] 
Target
Name:
Amyloid-beta A4 precursor protein-binding family A member 1
Synonyms:
APBA1_RAT Mint1 neuronal munc18-1 binding protein
Type:
Enzyme Catalytic Domain
Mol. Mass.:
92603.32
Organism:
Rattus norvegicus
Description:
gi_2625023
Residue:
839
  
Inhibitor
Name:
BDBM54762
Synonyms:
2-quinoxalinecarboxylic acid [2-[4-(hydroxymethyl)phenyl]-3-[(E)-3-methoxyprop-1-enyl]-7-methyl-6,8-dioxo-7-isoquinolinyl] ester MLS000438670 [2-[4-(hydroxymethyl)phenyl]-3-[(E)-3-methoxyprop-1-enyl]-7-methyl-6,8-bis(oxidanylidene)isoquinolin-7-yl] quinoxaline-2-carboxylate cid_16759686 | quinoxaline-2-carboxylic acid [6,8-diketo-3-[(E)-3-methoxyprop-1-enyl]-7-methyl-2-(4-methylolphenyl)-7-isoquinolyl] ester
Type:
Small organic molecule
Emp. Form.:
C30H25N3O6
Mol. Mass.:
523.536
SMILES:
COC\C=C\C1=CC2=CC(=O)C(C)(OC(=O)c3cnc4ccccc4n3)C(=O)C2=CN1c1ccc(CO)cc1
: