Target
2'-phosphotransferase
Ligand
BDBM46749
Substrate
Meas. Tech.
Fluorescence polarization-based biochemical high throughput dose response assay to identify inhibitors of tRNA 2'-phosphotransferase (TPT1).
IC50
>2063±n/a nM
Citation
 PubChem, PC Fluorescence polarization-based biochemical high throughput dose response assay to identify inhibitors of tRNA 2'-phosphotransferase (TPT1). PubChem Bioassay (2009)[AID] 
Target
Name:
2'-phosphotransferase
Synonyms:
likely tRNA 2'-phosphotransferase
Type:
Enzyme Catalytic Domain
Mol. Mass.:
23631.37
Organism:
Candida albicans SC5314
Description:
gi_68476498
Residue:
207
  
Inhibitor
Name:
BDBM46749
Synonyms:
1-acetyl-3-(2,6-dimethyl-4-pyranylidene)-2-indolone 1-acetyl-3-(2,6-dimethylpyran-4-ylidene)indol-2-one 3-(2,6-dimethylpyran-4-ylidene)-1-ethanoyl-indol-2-one SMR000019908 | cid_697318
Type:
Small organic molecule
Emp. Form.:
C17H15NO3
Mol. Mass.:
281.3059
SMILES:
[#6]-[#6](=O)-[#7]-1-[#6](=O)\[#6](-c2ccccc-12)=[#6]-1\[#6]=[#6](-[#6])-[#8]-[#6](-[#6])=[#6]-1
: