Target
2'-phosphotransferase
Ligand
BDBM51785
Substrate
Meas. Tech.
Fluorescence polarization-based biochemical high throughput dose response assay to identify inhibitors of tRNA 2'-phosphotransferase (TPT1).
IC50
8006±n/a nM
Citation
 PubChem, PC Fluorescence polarization-based biochemical high throughput dose response assay to identify inhibitors of tRNA 2'-phosphotransferase (TPT1). PubChem Bioassay (2009)[AID] 
Target
Name:
2'-phosphotransferase
Synonyms:
likely tRNA 2'-phosphotransferase
Type:
Enzyme Catalytic Domain
Mol. Mass.:
23631.37
Organism:
Candida albicans SC5314
Description:
gi_68476498
Residue:
207
  
Inhibitor
Name:
BDBM51785
Synonyms:
(5E)-1-(2,5-dimethoxyphenyl)-5-(2-furanylmethylidene)-2-sulfanylidene-1,3-diazinane-4,6-dione (5E)-1-(2,5-dimethoxyphenyl)-5-(2-furylmethylene)-2-thioxodihydropyrimidine-4,6(1H,5H)-dione MLS001197216 cid_1608674
Type:
Small organic molecule
Emp. Form.:
C17H14N2O5S
Mol. Mass.:
358.368
SMILES:
COc1ccc(OC)c(c1)N1C(=S)NC(=O)C(=Cc2ccco2)C1=O
: