Target
Procathepsin L
Ligand
BDBM55109
Substrate
Meas. Tech.
QFRET-based counterscreen for inhibitors of PFM18AAP: biochemical high throughput dose response assay for inhibitors of the Cathepsin L proteinase (CTSL1).
IC50
>59642±n/a nM
Citation
 PubChem, PC QFRET-based counterscreen for inhibitors of PFM18AAP: biochemical high throughput dose response assay for inhibitors of the Cathepsin L proteinase (CTSL1). PubChem Bioassay (2009)[AID] 
Target
Name:
Procathepsin L
Synonyms:
CATL1_HUMAN CTSL CTSL1 Cathepsin L Cathepsin L1 heavy chain MEP cathepsin L preproprotein
Type:
Enzyme
Mol. Mass.:
37557.19
Organism:
Homo sapiens (Human)
Description:
Purchased from Calbiochem (San Diego, CA).
Residue:
333
  
Inhibitor
Name:
BDBM55109
Synonyms:
2-[(4-methylphenyl)sulfonyl-(1,2,4-triazol-4-yl)amino]acetic acid methyl ester MLS000052573 cid_918926 methyl 2-[(4-methylphenyl)sulfonyl-(1,2,4-triazol-4-yl)amino]ethanoate | methyl N-[(4-methylphenyl)sulfonyl]-N-4H-1,2,4-triazol-4-ylglycinate
Type:
Small organic molecule
Emp. Form.:
C12H14N4O4S
Mol. Mass.:
310.329
SMILES:
COC(=O)CN(n1cnnc1)S(=O)(=O)c1ccc(C)cc1
: