Target
Procathepsin L
Ligand
BDBM55166
Substrate
Meas. Tech.
QFRET-based counterscreen for inhibitors of PFM18AAP: biochemical high throughput dose response assay for inhibitors of the Cathepsin L proteinase (CTSL1).
IC50
>59642±n/a nM
Citation
 PubChem, PC QFRET-based counterscreen for inhibitors of PFM18AAP: biochemical high throughput dose response assay for inhibitors of the Cathepsin L proteinase (CTSL1). PubChem Bioassay (2009)[AID] 
Target
Name:
Procathepsin L
Synonyms:
CATL1_HUMAN CTSL CTSL1 Cathepsin L Cathepsin L1 heavy chain MEP cathepsin L preproprotein
Type:
Enzyme
Mol. Mass.:
37557.19
Organism:
Homo sapiens (Human)
Description:
Purchased from Calbiochem (San Diego, CA).
Residue:
333
  
Inhibitor
Name:
BDBM55166
Synonyms:
1-(1,2,4-triazol-4-yl)-3-[3-(trifluoromethyl)phenyl]urea SMR000678339 | cid_4243593
Type:
Small organic molecule
Emp. Form.:
C10H8F3N5O
Mol. Mass.:
271.1986
SMILES:
FC(F)(F)c1cccc(NC(=O)Nn2cnnc2)c1
: