Target
Neutrophil cytosol factor 1 [S99G]
Ligand
BDBM34767
Substrate
Meas. Tech.
Dose Response Confirmation for small molecular inhibitors for p47phox, a regulatory protein of NADPH oxidases (Noxs)
IC50
50000±n/a nM
Citation
 PubChem, PC Dose Response Confirmation for small molecular inhibitors for p47phox, a regulatory protein of NADPH oxidases (Noxs) PubChem Bioassay (2008)[AID] 
Target
Name:
Neutrophil cytosol factor 1 [S99G]
Synonyms:
NCF1 NOXO2 neutrophil cytosolic factor 1
Type:
Enzyme Catalytic Domain
Mol. Mass.:
44664.39
Organism:
Homo sapiens (Human)
Description:
gi_115298672
Residue:
390
  
Inhibitor
Name:
BDBM34767
Synonyms:
MLS000548244 N-(2,3-dichloro-1-methoxy-4-oxo-1-naphthalenyl)-4-methylbenzenesulfonamide N-(2,3-dichloro-4-keto-1-methoxy-1-naphthyl)-4-methyl-benzenesulfonamide SMR000171238 | cid_3093671
Type:
Small organic molecule
Emp. Form.:
C18H15Cl2NO4S
Mol. Mass.:
412.287
SMILES:
COC1(NS(=O)(=O)c2ccc(C)cc2)C(Cl)=C(Cl)C(=O)c2ccccc12
: