Target
Neutrophil cytosol factor 1 [S99G]
Ligand
BDBM51857
Substrate
Meas. Tech.
Dose Response Confirmation for small molecular inhibitors for p47phox, a regulatory protein of NADPH oxidases (Noxs)
IC50
6240±n/a nM
Citation
 PubChem, PC Dose Response Confirmation for small molecular inhibitors for p47phox, a regulatory protein of NADPH oxidases (Noxs) PubChem Bioassay (2008)[AID] 
Target
Name:
Neutrophil cytosol factor 1 [S99G]
Synonyms:
NCF1 NOXO2 neutrophil cytosolic factor 1
Type:
Enzyme Catalytic Domain
Mol. Mass.:
44664.39
Organism:
Homo sapiens (Human)
Description:
gi_115298672
Residue:
390
  
Inhibitor
Name:
BDBM51857
Synonyms:
MLS001010894 N-[4-(3-bromophenyl)-1,3-thiazol-2-yl]-2-[3-[3-(dimethylamino)propyl]-4-oxoquinazolin-2-yl]sulfanylacetamide N-[4-(3-bromophenyl)thiazol-2-yl]-2-[[3-[3-(dimethylamino)propyl]-4-keto-quinazolin-2-yl]thio]acetamide cid_2080746
Type:
Small organic molecule
Emp. Form.:
C24H24BrN5O2S2
Mol. Mass.:
558.514
SMILES:
CN(C)CCCn1c(SCC(=O)Nc2nc(cs2)-c2cccc(Br)c2)nc2ccccc2c1=O
: