Target
Streptokinase A
Ligand
BDBM34375
Substrate
Meas. Tech.
Absorbance Microorganism-Based Dose Response HTS to Identify Inhibitors of Streptokinase Expression
EC50
150000±n/a nM
Citation
 PubChem, PC Absorbance Microorganism-Based Dose Response HTS to Identify Inhibitors of Streptokinase Expression PubChem Bioassay (2009)[AID] 
Target
Name:
Streptokinase A
Synonyms:
STRP_STRP1 streptokinase A precursor
Type:
Enzyme Catalytic Domain
Mol. Mass.:
49924.80
Organism:
Streptococcus pyogenes M1 GAS
Description:
gi_15675770
Residue:
440
  
Inhibitor
Name:
BDBM34375
Synonyms:
3-O-ethyl 8-O-methyl 5-oxo-1-sulfanylidene-4H-[1,3]thiazolo[3,4-a]quinazoline-3,8-dicarboxylate 5-keto-1-thioxo-4H-thiazolo[3,4-a]quinazoline-3,8-dicarboxylic acid O3-ethyl ester O8-methyl ester MLS000094734 SMR000030287 | cid_3240606
Type:
Small organic molecule
Emp. Form.:
C15H12N2O5S2
Mol. Mass.:
364.396
SMILES:
CCOC(=O)c1sc(=S)n2c1[nH]c(=O)c1ccc(cc21)C(=O)OC
: