Target
Gag-Pol polyprotein [588-1027]/[588-1147]
Ligand
BDBM1868
Substrate
(poly)rC:(oligo)dG
Meas. Tech.
HIV-1 RT Assay
pH
8.2±n/a
IC50
311±n/a nM
Citation
 Williams, TMCiccarone, TMMacTough, SCRooney, CSBalani, SKCondra, JHEmini, EAGoldman, MEGreenlee, WJKauffman, LR 5-chloro-3-(phenylsulfonyl)indole-2-carboxamide: a novel, non-nucleoside inhibitor of HIV-1 reverse transcriptase. J Med Chem 36:1291-4 (1993)  
Target
Name:
Gag-Pol polyprotein [588-1027]/[588-1147]
Synonyms:
EC: 2.7.7.49 | HIV-1 Reverse Transcriptase
Type:
Protein Complex
Mol. Mass.:
115684
Description:
Components:
This complex has 2 components.
Component 1
Name:
Gag-Pol polyprotein [588-1147]
Synonyms:
HIV-1 Reverse Transcriptase Chain A gag-pol
Type:
Enzyme Subunit
Mol. Mass.:
64486.41
Organism:
Human immunodeficiency virus type 1
Description:
P04585[588-1147]
Residue:
560
  
Component 2
Name:
Gag-Pol polyprotein [588-1027]
Synonyms:
HIV-1 Reverse Transcriptase Chain B gag-pol
Type:
Enzyme Subunit
Mol. Mass.:
51337.13
Organism:
Human immunodeficiency virus type 1
Description:
P04585[588-1027]
Residue:
440
  
Inhibitor
Name:
BDBM1868
Synonyms:
(+)-(5S)-4,5,6,7-tetrahydro-9-chloro 5-methyl-6-(3-methyl-2-butenyl)imidazo[4,5,1-jk] [ 1,4] benzodiazepine 2(1M-thione 9-Chloro-TIBO R82913
Type:
Small organic molecule
Emp. Form.:
C16H20ClN3S
Mol. Mass.:
321.868
SMILES:
C[C@H]1Cn2c3c(CN1CC=C(C)C)cc(Cl)cc3[nH]c2=S
:
Substrate
Name:
(poly)rC:(oligo)dG
Synonyms:
Type:
RNA-DNA duplex
Mol. Mass.:
358.43
Organism:
Description:
The incorporation of Tritium-labeled [3H]dGTP onto a (poly)rC:(oligo)dG template:primer.
Residue:
3
NA