Target
Nucleotide-binding oligomerization domain-containing protein 1
Ligand
BDBM59524
Substrate
Meas. Tech.
uHTS luminescence assay for the identification of compounds that inhibit NOD1
EC50
20000±n/a nM
Citation
 PubChem, PC uHTS luminescence assay for the identification of compounds that inhibit NOD1 PubChem Bioassay (2010)[AID] 
Target
Name:
Nucleotide-binding oligomerization domain-containing protein 1
Synonyms:
CARD4 NOD1_HUMAN | nucleotide-binding oligomerization domain containing 1
Type:
Enzyme Catalytic Domain
Mol. Mass.:
107699.03
Organism:
Homo sapiens (Human)
Description:
gi_5174617
Residue:
953
  
Inhibitor
Name:
BDBM59524
Synonyms:
1-(1-allyl-2,5-dimethyl-pyrrol-3-yl)-2-[(6-methyl-2-nitro-3-pyridyl)oxy]ethanone 1-(2,5-dimethyl-1-prop-2-enyl-pyrrol-3-yl)-2-(6-methyl-2-nitro-pyridin-3-yl)oxy-ethanone MLS000389606 cid_4354817
Type:
Small organic molecule
Emp. Form.:
C17H19N3O4
Mol. Mass.:
329.3505
SMILES:
Cc1cc(C(=O)COc2ccc(C)nc2[N+]([O-])=O)c(C)n1CC=C
: