Target
M17 leucyl aminopeptidase
Ligand
BDBM59960
Substrate
Meas. Tech.
Inhibitors of Plasmodium falciparum M17- Family Leucine Aminopeptidase (M17LAP)
IC50
8470±n/a nM
Citation
 PubChem, PC Inhibitors of Plasmodium falciparum M17- Family Leucine Aminopeptidase (M17LAP) PubChem Bioassay (2009)[AID] 
Target
Name:
M17 leucyl aminopeptidase
Synonyms:
leucine aminopeptidase
Type:
Enzyme Catalytic Domain
Mol. Mass.:
67834.32
Organism:
Plasmodium falciparum 3D7
Description:
gi_124809582
Residue:
605
  
Inhibitor
Name:
BDBM59960
Synonyms:
(3-nitrophenyl) 2-[2-oxidanylidene-2-[(4-propan-2-ylphenyl)amino]ethyl]sulfanylpyridine-3-carboxylate 2-[(2-cumidino-2-keto-ethyl)thio]nicotinic acid (3-nitrophenyl) ester 3-nitrophenyl 2-({2-[(4-isopropylphenyl)amino]-2-oxoethyl}thio)nicotinate SMR000207006 | cid_4066820
Type:
Small organic molecule
Emp. Form.:
C23H21N3O5S
Mol. Mass.:
451.495
SMILES:
CC(C)c1ccc(NC(=O)CSc2ncccc2C(=O)Oc2cccc(c2)[N+]([O-])=O)cc1
: