Target
Dual specificity protein phosphatase 3
Ligand
BDBM51785
Substrate
Meas. Tech.
uHTS absorbance assay for the identification of compounds that inhibit VHR1.
IC50
1230±n/a nM
Citation
 PubChem, PC uHTS absorbance assay for the identification of compounds that inhibit VHR1. PubChem Bioassay (2009)[AID] 
Target
Name:
Dual specificity protein phosphatase 3
Synonyms:
DUS3_HUMAN Dual specificity protein phosphatase (VHR) Dual specificity protein phosphatase VHR Tyrosine-protein phosphatase non-receptor type 1 | VHR
Type:
Hydrolase
Mol. Mass.:
20480.58
Organism:
Homo sapiens (Human)
Description:
Residue:
185
  
Inhibitor
Name:
BDBM51785
Synonyms:
(5E)-1-(2,5-dimethoxyphenyl)-5-(2-furanylmethylidene)-2-sulfanylidene-1,3-diazinane-4,6-dione (5E)-1-(2,5-dimethoxyphenyl)-5-(2-furylmethylene)-2-thioxodihydropyrimidine-4,6(1H,5H)-dione MLS001197216 cid_1608674
Type:
Small organic molecule
Emp. Form.:
C17H14N2O5S
Mol. Mass.:
358.368
SMILES:
COc1ccc(OC)c(c1)N1C(=S)NC(=O)C(=Cc2ccco2)C1=O
: