Target
Kappa-type opioid receptor
Ligand
BDBM54797
Substrate
Meas. Tech.
uHTS identification of small molecule antagonists of the kappa opioid receptor via a luminescent beta-arrestin assay
IC50
7410±n/a nM
Citation
 PubChem, PC uHTS identification of small molecule antagonists of the kappa opioid receptor via a luminescent beta-arrestin assay PubChem Bioassay (2009)[AID] 
Target
Name:
Kappa-type opioid receptor
Synonyms:
K-OR-1 Kappa-opioid receptor (KOR) Kappa-type opioid receptor (KOR) OPIATE Kappa OPRK1 kappa opioid receptor (KOR)
Type:
G Protein-Coupled Receptor (GPCR)
Mol. Mass.:
42648.76
Organism:
Homo sapiens (Human)
Description:
P41145
Residue:
380
  
Inhibitor
Name:
BDBM54797
Synonyms:
2-chloranyl-N-[2,2,2-tris(chloranyl)-1-[(4-methoxy-2-nitro-phenyl)carbamothioylamino]ethyl]benzamide 2-chloro-N-[2,2,2-trichloro-1-[(4-methoxy-2-nitro-phenyl)thiocarbamoylamino]ethyl]benzamide 2-chloro-N-[2,2,2-trichloro-1-[[(4-methoxy-2-nitroanilino)-sulfanylidenemethyl]amino]ethyl]benzamide SMR000137062 | cid_2830589
Type:
Small organic molecule
Emp. Form.:
C17H14Cl4N4O4S
Mol. Mass.:
512.194
SMILES:
COc1ccc(NC(=S)NC(NC(=O)c2ccccc2Cl)C(Cl)(Cl)Cl)c(c1)[N+]([O-])=O
: