Target
G-protein coupled receptor 55
Ligand
BDBM40268
Substrate
Meas. Tech.
Image-based HTS for Selective Agonists of GPR55
EC50
32000±n/a nM
Citation
 PubChem, PC Image-based HTS for Selective Agonists of GPR55 PubChem Bioassay (2010)[AID] 
Target
Name:
G-protein coupled receptor 55
Synonyms:
G protein-coupled receptor 55 GPR55_HUMAN
Type:
PROTEIN
Mol. Mass.:
36649.72
Organism:
Homo sapiens (Human)
Description:
ChEMBL_1292265
Residue:
319
  
Inhibitor
Name:
BDBM40268
Synonyms:
5-(1,3-benzodioxol-5-yl)-N-(2-furanylmethyl)-7-(trifluoromethyl)-2-pyrazolo[1,5-a]pyrimidinecarboxamide 5-(1,3-benzodioxol-5-yl)-N-(furan-2-ylmethyl)-7-(trifluoromethyl)pyrazolo[1,5-a]pyrimidine-2-carboxamide MLS000072642 cid_645580
Type:
Small organic molecule
Emp. Form.:
C20H13F3N4O4
Mol. Mass.:
430.3368
SMILES:
FC(F)(F)c1cc(nc2cc(nn12)C(=O)NCc1ccco1)-c1ccc2OCOc2c1
: