Target
Bcl-2-like protein 1
Ligand
BDBM50303406
Substrate
Meas. Tech.
Counterscreen for inhibitors of MCL1: fluorescence polarization-based biochemical high throughput dose response assay for inhibitors of BCL2-related protein, long isoform (BCLXL).
IC50
36268±n/a nM
Citation
 PubChem, PC Counterscreen for inhibitors of MCL1: fluorescence polarization-based biochemical high throughput dose response assay for inhibitors of BCL2-related protein, long isoform (BCLXL). PubChem Bioassay (2009)[AID] 
Target
Name:
Bcl-2-like protein 1
Synonyms:
Anti-apoptotic Bcl-2 protein Apoptosis regulator Bcl-X BCL2-like 1 isoform 1 BCL2L1 Bcl-2-like protein 1 (Bcl-XL) Bcl-xL/Bcl-2-binding component 3 Bcl2-antagonist of cell death (BAD)
Type:
Mitochondrion membrane; Single-pass membrane protein
Mol. Mass.:
26039.60
Organism:
Homo sapiens (Human)
Description:
Residue:
233
  
Inhibitor
Name:
BDBM50303406
Synonyms:
2-(2-(4-methyl-4H-1,2,4-triazol-3-ylthio)acetamido)-5,6-dihydro-4H-cyclopenta[b]thiophene-3-carboxamide cid_2514971
Type:
Small organic molecule
Emp. Form.:
C13H15N5O2S2
Mol. Mass.:
337.421
SMILES:
Cn1cnnc1SCC(=O)Nc1sc2CCCc2c1C(N)=O
: