Target
Bcl-2-like protein 1
Ligand
BDBM61866
Substrate
Meas. Tech.
Counterscreen for inhibitors of MCL1: fluorescence polarization-based biochemical high throughput dose response assay for inhibitors of BCL2-related protein, long isoform (BCLXL).
IC50
55186±n/a nM
Citation
 PubChem, PC Counterscreen for inhibitors of MCL1: fluorescence polarization-based biochemical high throughput dose response assay for inhibitors of BCL2-related protein, long isoform (BCLXL). PubChem Bioassay (2009)[AID] 
Target
Name:
Bcl-2-like protein 1
Synonyms:
Anti-apoptotic Bcl-2 protein Apoptosis regulator Bcl-X BCL2-like 1 isoform 1 BCL2L1 Bcl-2-like protein 1 (Bcl-XL) Bcl-xL/Bcl-2-binding component 3 Bcl2-antagonist of cell death (BAD)
Type:
Mitochondrion membrane; Single-pass membrane protein
Mol. Mass.:
26039.60
Organism:
Homo sapiens (Human)
Description:
Residue:
233
  
Inhibitor
Name:
BDBM61866
Synonyms:
2-methyl-N-[(5-nitro-2-furanyl)methylideneamino]-3-imidazo[1,2-a]pyridinecarboxamide 2-methyl-N-[(5-nitrofuran-2-yl)methylideneamino]imidazo[1,2-a]pyridine-3-carboxamide SMR000347710 | cid_4460323
Type:
Small organic molecule
Emp. Form.:
C14H11N5O4
Mol. Mass.:
313.2682
SMILES:
Cc1nc2ccccn2c1C(=O)N\N=C\c1ccc(o1)[N+]([O-])=O
: