Target
Regulator of G-protein signaling 19
Ligand
BDBM47764
Substrate
Meas. Tech.
Dose response, multiplexed high-throughput screen for small molecule regulators of RGS family protein interactions, specifically RGS19-Galphao for SAR Compounds
EC50
56±n/a nM
Citation
 PubChem, PC Dose response, multiplexed high-throughput screen for small molecule regulators of RGS family protein interactions, specifically RGS19-Galphao for SAR Compounds PubChem Bioassay (2010)[AID] 
Target
Name:
Regulator of G-protein signaling 19
Synonyms:
G protein signalling regulator 19 GNAI3IP RGS19_HUMAN | Regulator of G-protein signaling 19 (RGS19)
Type:
Enzyme Catalytic Domain
Mol. Mass.:
24631.38
Organism:
Homo sapiens (Human)
Description:
gi_86990435
Residue:
217
  
Inhibitor
Name:
BDBM47764
Synonyms:
(4E)-5-methyl-4-[[3-[[(Z)-(3-methyl-1-phenyl-5-sulfanylidene-4-pyrazolylidene)methyl]amino]propylamino]methylidene]-2-phenyl-3-pyrazolethione (4E)-5-methyl-4-[[3-[[(Z)-(3-methyl-1-phenyl-5-sulfanylidenepyrazol-4-ylidene)methyl]amino]propylamino]methylidene]-2-phenylpyrazole-3-thione 3-methyl-4-{[(3-{[(3-methyl-1-phenyl-5-sulfanyl-1H-pyrazol-4-yl)methylene]amino}propyl)imino]methyl}-1-phenyl-1H-pyrazole-5-thiol SMR000225437 | cid_5581000
Type:
Small organic molecule
Emp. Form.:
C25H26N6S2
Mol. Mass.:
474.644
SMILES:
Cc1[nH]n(-c2ccccc2)c(=S)c1C=NCCCN=Cc1c(C)[nH]n(-c2ccccc2)c1=S
: