Target
Nucleotide-binding oligomerization domain-containing protein 1
Ligand
BDBM54421
Substrate
Meas. Tech.
SAR analysis of compounds that inhibit NOD1 revised
IC50
5430±n/a nM
Citation
 PubChem, PC SAR analysis of compounds that inhibit NOD1 revised PubChem Bioassay (2010)[AID] 
Target
Name:
Nucleotide-binding oligomerization domain-containing protein 1
Synonyms:
CARD4 NOD1_HUMAN | nucleotide-binding oligomerization domain containing 1
Type:
Enzyme Catalytic Domain
Mol. Mass.:
107699.03
Organism:
Homo sapiens (Human)
Description:
gi_5174617
Residue:
953
  
Inhibitor
Name:
BDBM54421
Synonyms:
3-(2,5,9-trimethyl-7-oxidanylidene-3-phenyl-furo[3,2-g]chromen-6-yl)propanoic acid 3-(2,5,9-trimethyl-7-oxo-3-phenylfuro[3,2-g]chromen-6-yl)propanoic acid MLS001165357 cid_1796094
Type:
Small organic molecule
Emp. Form.:
C23H20O5
Mol. Mass.:
376.4019
SMILES:
Cc1oc2c(C)c3oc(=O)c(CCC(O)=O)c(C)c3cc2c1-c1ccccc1
: