Target
Sphingosine 1-phosphate receptor 2
Ligand
BDBM62405
Substrate
Meas. Tech.
Late stage counterscreen assay for S1P4 antagonists: Fluorescence dose response cell-based screening assay for antagonists of the Sphingosine 1-Phosphate Receptor 2 (S1P2)
IC50
>25000±n/a nM
Citation
 PubChem, PC Late stage counterscreen assay for S1P4 antagonists: Fluorescence dose response cell-based screening assay for antagonists of the Sphingosine 1-Phosphate Receptor 2 (S1P2) PubChem Bioassay (2010)[AID] 
Target
Name:
Sphingosine 1-phosphate receptor 2
Synonyms:
EDG5 S1PR2 Sphingosine 1-phosphate receptor Sphingosine-1-phosphate receptor 2 | ndothelial differentiation G-protein coupled receptor 5
Type:
G Protein-Coupled Receptor (GPCR)
Mol. Mass.:
38883.16
Organism:
Homo sapiens (Human)
Description:
Membranes isolated from S1P2-transfected CHO cells were used in ligand binding assay.
Residue:
353
  
Inhibitor
Name:
BDBM62405
Synonyms:
5-(2,5-dichlorophenyl)-N-(2-methyl-1-naphthalenyl)-2-furancarboxamide 5-(2,5-dichlorophenyl)-N-(2-methylnaphthalen-1-yl)furan-2-carboxamide SR-02000000249 cid_44607574
Type:
Small organic molecule
Emp. Form.:
C22H15Cl2NO2
Mol. Mass.:
396.266
SMILES:
Cc1ccc2ccccc2c1NC(=O)c1ccc(o1)-c1cc(Cl)ccc1Cl
: