Target
Kappa-type opioid receptor
Ligand
BDBM54836
Substrate
Meas. Tech.
SAR analysis of Agonists of the Kappa Opioid Receptor (KOR) using an Image-Based Assay
EC50
>32000±n/a nM
Citation
 PubChem, PC SAR analysis of Agonists of the Kappa Opioid Receptor (KOR) using an Image-Based Assay PubChem Bioassay (2010)[AID] 
Target
Name:
Kappa-type opioid receptor
Synonyms:
K-OR-1 Kappa-opioid receptor (KOR) Kappa-type opioid receptor (KOR) OPIATE Kappa OPRK1 kappa opioid receptor (KOR)
Type:
G Protein-Coupled Receptor (GPCR)
Mol. Mass.:
42648.76
Organism:
Homo sapiens (Human)
Description:
P41145
Residue:
380
  
Inhibitor
Name:
BDBM54836
Synonyms:
4-[1-[(7-chloro-4-quinolinyl)hydrazo]propylidene]-1-cyclohexa-2,5-dienone 4-[1-[2-(7-chloroquinolin-4-yl)hydrazinyl]propylidene]cyclohexa-2,5-dien-1-one MLS001173902 cid_6036600
Type:
Small organic molecule
Emp. Form.:
C18H16ClN3O
Mol. Mass.:
325.792
SMILES:
CCC(N=Nc1ccnc2cc(Cl)ccc12)c1ccc(O)cc1
: