Target
Kappa-type opioid receptor
Ligand
BDBM62175
Substrate
Meas. Tech.
SAR analysis of Agonists of the Kappa Opioid Receptor (KOR) using an Image-Based Assay
EC50
>32000±n/a nM
Citation
 PubChem, PC SAR analysis of Agonists of the Kappa Opioid Receptor (KOR) using an Image-Based Assay PubChem Bioassay (2010)[AID] 
Target
Name:
Kappa-type opioid receptor
Synonyms:
K-OR-1 Kappa-opioid receptor (KOR) Kappa-type opioid receptor (KOR) OPIATE Kappa OPRK1 kappa opioid receptor (KOR)
Type:
G Protein-Coupled Receptor (GPCR)
Mol. Mass.:
42648.76
Organism:
Homo sapiens (Human)
Description:
P41145
Residue:
380
  
Inhibitor
Name:
BDBM62175
Synonyms:
MLS-0015758.0001 N-[(7-methyl-2-oxidanylidene-1H-quinolin-3-yl)methyl]-N-propyl-pyridine-2-carboxamide N-[(7-methyl-2-oxo-1H-quinolin-3-yl)methyl]-N-propylpyridine-2-carboxamide | cid_665037
Type:
Small organic molecule
Emp. Form.:
C20H21N3O2
Mol. Mass.:
335.3996
SMILES:
CCCN(Cc1cc2ccc(C)cc2[nH]c1=O)C(=O)c1ccccn1
: