Target
Kappa-type opioid receptor
Ligand
BDBM62184
Substrate
Meas. Tech.
SAR analysis of Agonists of the Kappa Opioid Receptor (KOR) using an Image-Based Assay
EC50
5820±n/a nM
Citation
 PubChem, PC SAR analysis of Agonists of the Kappa Opioid Receptor (KOR) using an Image-Based Assay PubChem Bioassay (2010)[AID] 
Target
Name:
Kappa-type opioid receptor
Synonyms:
K-OR-1 Kappa-opioid receptor (KOR) Kappa-type opioid receptor (KOR) OPIATE Kappa OPRK1 kappa opioid receptor (KOR)
Type:
G Protein-Coupled Receptor (GPCR)
Mol. Mass.:
42648.76
Organism:
Homo sapiens (Human)
Description:
P41145
Residue:
380
  
Inhibitor
Name:
BDBM62184
Synonyms:
MLS-0425692.0001 [1-[[1-(3-methylphenyl)imidazol-2-yl]methyl]-4-(oxan-2-ylmethyl)piperidin-4-yl]methanol cid_44537711
Type:
Small organic molecule
Emp. Form.:
C23H33N3O2
Mol. Mass.:
383.527
SMILES:
Cc1cccc(c1)-n1ccnc1CN1CCC(CO)(CC2CCCCO2)CC1
: