Target
Kappa-type opioid receptor
Ligand
BDBM62198
Substrate
Meas. Tech.
SAR analysis of Agonists of the Kappa Opioid Receptor (KOR) using an Image-Based Assay
EC50
>32000±n/a nM
Citation
 PubChem, PC SAR analysis of Agonists of the Kappa Opioid Receptor (KOR) using an Image-Based Assay PubChem Bioassay (2010)[AID] 
Target
Name:
Kappa-type opioid receptor
Synonyms:
K-OR-1 Kappa-opioid receptor (KOR) Kappa-type opioid receptor (KOR) OPIATE Kappa OPRK1 kappa opioid receptor (KOR)
Type:
G Protein-Coupled Receptor (GPCR)
Mol. Mass.:
42648.76
Organism:
Homo sapiens (Human)
Description:
P41145
Residue:
380
  
Inhibitor
Name:
BDBM62198
Synonyms:
(phenylmethyl) N-[2,2,2-tris(chloranyl)-1-[(4-fluorophenyl)carbamothioylamino]ethyl]carbamate N-[2,2,2-trichloro-1-[(4-fluorophenyl)thiocarbamoylamino]ethyl]carbamic acid benzyl ester benzyl N-[2,2,2-trichloro-1-[(4-fluorophenyl)carbamothioylamino]ethyl]carbamate | cid_3091277
Type:
Small organic molecule
Emp. Form.:
C17H15Cl3FN3O2S
Mol. Mass.:
450.742
SMILES:
Fc1ccc(NC(=S)NC(NC(=O)OCc2ccccc2)C(Cl)(Cl)Cl)cc1
: